Reaction Details
TargetRetinoic acid receptor RXR-alpha
LigandBDBM50129720
Substrate/Competitorn/a
Meas. Tech.ChEMBL_196768 (CHEMBL798929)
Ki 3±n/a nM
Citation Michellys, PYArdecky, RJChen, JHCrombie, DLEtgen, GJFaul, MMFaulkner, ALGrese, TAHeyman, RAKaranewsky, DSKlausing, KLeibowitz, MDLiu, SMais, DAMapes, CMMarschke, KBReifel-Miller, AOgilvie, KMRungta, DThompson, AWTyhonas, JSBoehm, MF Novel (2E,4E,6Z)-7-(2-alkoxy-3,5-dialkylbenzene)-3-methylocta-2,4,6-trienoic acid retinoid X receptor modulators are active in models of type 2 diabetes. J Med Chem46:2683-96 (2003) 
 
Retinoic acid receptor RXR-alpha
Name:Retinoic acid receptor RXR-alpha
Type:PROTEIN
Mol. Mass.:50820.38
Organism:Homo sapiens (Human)
Description:ChEMBL_1456363
Residue:462
BDBM50129720
NameBDBM50129720
Synonyms:(2E,4E,6Z)-7-[3,5-Di-tert-butyl-2-(2,2-difluoro-ethoxy)-phenyl]-3-methyl-octa-2,4,6-trienoic acid CHEMBL42314
TypeSmall organic molecule
Emp. Form.C25H34F2O3
Mol. Mass.420.5325
SMILESC\C(\C=C\C=C(\C)c1cc(cc(c1OCC(F)F)C(C)(C)C)C(C)(C)C)=C/C(O)=O