Reaction Details
TargetRetinoic acid receptor gamma
LigandBDBM50129730
Substrate/Competitorn/a
Meas. Tech.ChEMBL_196008 (CHEMBL797872)
Ki 10000±n/a nM
Citation Michellys, PYArdecky, RJChen, JHCrombie, DLEtgen, GJFaul, MMFaulkner, ALGrese, TAHeyman, RAKaranewsky, DSKlausing, KLeibowitz, MDLiu, SMais, DAMapes, CMMarschke, KBReifel-Miller, AOgilvie, KMRungta, DThompson, AWTyhonas, JSBoehm, MF Novel (2E,4E,6Z)-7-(2-alkoxy-3,5-dialkylbenzene)-3-methylocta-2,4,6-trienoic acid retinoid X receptor modulators are active in models of type 2 diabetes. J Med Chem46:2683-96 (2003) 
 
Retinoic acid receptor gamma
Name:Retinoic acid receptor gamma
Type:PROTEIN
Mol. Mass.:50345.43
Organism:Homo sapiens (Human)
Description:ChEMBL_1458016
Residue:454
BDBM50129730
NameBDBM50129730
Synonyms:7-[3,5-Bis-(1,1-dimethyl-propyl)-2-methoxy-phenyl]-3-methyl-octa-2,4,6-trienoic acid | CHEMBL91185
TypeSmall organic molecule
Emp. Form.C26H38O3
Mol. Mass.398.5781
SMILESCCC(C)(C)c1cc(\C(C)=C/C=C/C(/C)=C/C(O)=O)c(OC)c(c1)C(C)(C)CC