Reaction Details
TargetRetinoic acid receptor RXR-alpha
LigandBDBM50129717
Substrate/Competitorn/a
Meas. Tech.ChEMBL_196756 (CHEMBL800545)
EC50 2±n/a nM
Citation Michellys, PYArdecky, RJChen, JHCrombie, DLEtgen, GJFaul, MMFaulkner, ALGrese, TAHeyman, RAKaranewsky, DSKlausing, KLeibowitz, MDLiu, SMais, DAMapes, CMMarschke, KBReifel-Miller, AOgilvie, KMRungta, DThompson, AWTyhonas, JSBoehm, MF Novel (2E,4E,6Z)-7-(2-alkoxy-3,5-dialkylbenzene)-3-methylocta-2,4,6-trienoic acid retinoid X receptor modulators are active in models of type 2 diabetes. J Med Chem46:2683-96 (2003) 
 
Retinoic acid receptor RXR-alpha
Name:Retinoic acid receptor RXR-alpha
Type:PROTEIN
Mol. Mass.:50820.38
Organism:Homo sapiens (Human)
Description:ChEMBL_1456363
Residue:462
BDBM50129717
NameBDBM50129717
Synonyms:7-(3,5-Diisopropyl-2-methoxy-phenyl)-3-methyl-octa-2,4,6-trienoic acid | CHEMBL90824
TypeSmall organic molecule
Emp. Form.C22H30O3
Mol. Mass.342.4718
SMILESCOc1c(cc(cc1\C(C)=C/C=C/C(/C)=C/C(O)=O)C(C)C)C(C)C