Reaction Details
TargetAmyloid-beta precursor protein
LigandBDBM50052710
Substrate/Competitorn/a
Meas. Tech.ChEMBL_35793 (CHEMBL649400)
Ki 46±n/a nM
Citation Mathis, CAWang, YHolt, DPHuang, GFDebnath, MLKlunk, WE Synthesis and evaluation of 11C-labeled 6-substituted 2-arylbenzothiazoles as amyloid imaging agents. J Med Chem46:2740-54 (2003) 
 
Amyloid-beta precursor protein
Name:Amyloid-beta precursor protein
Type:Single-pass type I membrane protein
Mol. Mass.:86890.41
Organism:Homo sapiens (Human)
Description:P05067
Residue:770
BDBM50052710
NameBDBM50052710
Synonyms:2-(4-Amino-phenyl)-benzothiazol-6-ol | CHEMBL93884
TypeSmall organic molecule
Emp. Form.C13H10N2OS
Mol. Mass.242.296
SMILESNc1ccc(cc1)-c1nc2ccc(O)cc2s1