Reaction Details
TargetAmyloid-beta precursor protein
LigandBDBM50129793
Substrate/Competitorn/a
Meas. Tech.ChEMBL_35793 (CHEMBL649400)
Ki 4.3±n/a nM
Citation Mathis, CAWang, YHolt, DPHuang, GFDebnath, MLKlunk, WE Synthesis and evaluation of 11C-labeled 6-substituted 2-arylbenzothiazoles as amyloid imaging agents. J Med Chem46:2740-54 (2003) 
 
Amyloid-beta precursor protein
Name:Amyloid-beta precursor protein
Type:Single-pass type I membrane protein
Mol. Mass.:86890.41
Organism:Homo sapiens (Human)
Description:P05067
Residue:770
BDBM50129793
NameBDBM50129793
Synonyms:2-(4''-methylaminophenyl)-6-hydroxybenzothiazole 2-(4-Methylamino-phenyl)-benzothiazol-6-ol 6-Hydroxy-2-(4''-N-methylaminophenyl)-1,3-benzothiazole CHEMBL93124 N-methyl-[11C]2-(40-methylaminophenyl)-6-hydroxy benzothiazole | [3H]2-(4-(methylamino)phenyl)benzo[d]thiazol-6-ol
TypeSmall organic molecule
Emp. Form.C14H12N2OS
Mol. Mass.256.323
SMILESCNc1ccc(cc1)-c1nc2ccc(O)cc2s1