Reaction Details
TargetDipeptidyl peptidase 4
LigandBDBM11694
Substrate/Competitorn/a
Meas. Tech.ChEMBL_53356 (CHEMBL664526)
IC50 2.8±n/a nM
Citation Villhauer, EBBrinkman, JANaderi, GBBurkey, BFDunning, BEPrasad, KMangold, BLRussell, MEHughes, TE 1-[[(3-hydroxy-1-adamantyl)amino]acetyl]-2-cyano-(S)-pyrrolidine: a potent, selective, and orally bioavailable dipeptidyl peptidase IV inhibitor with antihyperglycemic properties. J Med Chem46:2774-89 (2003) 
 
Dipeptidyl peptidase 4
Name:Dipeptidyl peptidase 4
Type:Enzyme
Mol. Mass.:88084.94
Organism:Rattus norvegicus (rat)
Description:n/a
Residue:767
BDBM11694
NameBDBM11694
Synonyms:(2S)-1-[(2S)-2-amino-2-cyclohexylacetyl]pyrrolidine-2-carbonitrile CHEMBL307636 Cyclohexylglycine-(2S)-cyanopyrrolidine 2
TypeSmall organic molecule
Emp. Form.C13H21N3O
Mol. Mass.235.3253
SMILESN[C@@H](C1CCCCC1)C(=O)N1CCC[C@H]1C#N