Reaction Details
TargetDipeptidyl peptidase 4
LigandBDBM50129889
Substrate/Competitorn/a
Meas. Tech.ChEMBL_53339 (CHEMBL664924)
IC50 2.7±n/a nM
Citation Villhauer, EBBrinkman, JANaderi, GBBurkey, BFDunning, BEPrasad, KMangold, BLRussell, MEHughes, TE 1-[[(3-hydroxy-1-adamantyl)amino]acetyl]-2-cyano-(S)-pyrrolidine: a potent, selective, and orally bioavailable dipeptidyl peptidase IV inhibitor with antihyperglycemic properties. J Med Chem46:2774-89 (2003) 
 
Dipeptidyl peptidase 4
Name:Dipeptidyl peptidase 4
Type:Enzyme
Mol. Mass.:88271.01
Organism:Homo sapiens (Human)
Description:P27487
Residue:766
BDBM50129889
NameBDBM50129889
Synonyms:1-[2-(3-Hydroxy-adamantan-1-ylamino)-acetyl]-pyrrolidine-2-carbonitrile | CHEMBL319819
TypeSmall organic molecule
Emp. Form.C17H25N3O2
Mol. Mass.303.3993
SMILESO[C@]12C[C@@H]3C[C@H](C1)CC(C3)(C2)NCC(=O)N1CCC[C@H]1C#N