Reaction Details
TargetDipeptidyl peptidase 4
LigandBDBM50129900
Substrate/Competitorn/a
Meas. Tech.ChEMBL_53208 (CHEMBL664029)
IC50 16±n/a nM
Citation Villhauer, EBBrinkman, JANaderi, GBBurkey, BFDunning, BEPrasad, KMangold, BLRussell, MEHughes, TE 1-[[(3-hydroxy-1-adamantyl)amino]acetyl]-2-cyano-(S)-pyrrolidine: a potent, selective, and orally bioavailable dipeptidyl peptidase IV inhibitor with antihyperglycemic properties. J Med Chem46:2774-89 (2003) 
 
Dipeptidyl peptidase 4
Name:Dipeptidyl peptidase 4
Type:Enzyme
Mol. Mass.:88271.01
Organism:Homo sapiens (Human)
Description:P27487
Residue:766
BDBM50129900
NameBDBM50129900
Synonyms:(1R,2R,3R,5S)1-[2-(2,6,6-Trimethyl-bicyclo[3.1.1]hept-3-ylamino)-acetyl]-pyrrolidine-2-carbonitrile | CHEMBL96459
TypeSmall organic molecule
Emp. Form.C17H27N3O
Mol. Mass.289.4158
SMILESCC1C2CC(CC1NCC(=O)N1CCC[C@H]1C#N)C2(C)C