Reaction Details
TargetDipeptidyl peptidase 4
LigandBDBM50129932
Substrate/Competitorn/a
Meas. Tech.ChEMBL_53208 (CHEMBL664029)
IC50 63±n/a nM
Citation Villhauer, EBBrinkman, JANaderi, GBBurkey, BFDunning, BEPrasad, KMangold, BLRussell, MEHughes, TE 1-[[(3-hydroxy-1-adamantyl)amino]acetyl]-2-cyano-(S)-pyrrolidine: a potent, selective, and orally bioavailable dipeptidyl peptidase IV inhibitor with antihyperglycemic properties. J Med Chem46:2774-89 (2003) 
 
Dipeptidyl peptidase 4
Name:Dipeptidyl peptidase 4
Type:Enzyme
Mol. Mass.:88271.01
Organism:Homo sapiens (Human)
Description:P27487
Residue:766
BDBM50129932
NameBDBM50129932
Synonyms:1-(2-Cycloheptylamino-acetyl)-pyrrolidine-2-carbonitrile | CHEMBL323130
TypeSmall organic molecule
Emp. Form.C14H23N3O
Mol. Mass.249.3519
SMILESO=C(CNC1CCCCCC1)N1CCC[C@H]1C#N