Reaction Details
TargetSerine protease 1
LigandBDBM14543
Substrate/Competitorn/a
Meas. Tech.ChEBML_213045
IC50 32±n/a nM
Citation South, MSCase, BLWood, RSJones, DEHayes, MJGirard, TJLachance, RMNicholson, NSClare, MStevens, AMStegeman, RAStallings, WCKurumbail, RGParlow, JJ Structure-based drug design of pyrazinone antithrombotics as selective inhibitors of the tissue factor VIIa complex. Bioorg Med Chem Lett13:2319-25 (2003) Serine protease 1
Name:Serine protease 1
Type:Enzyme
Mol. Mass.:26557.80
Organism:Homo sapiens (Human)
Description:P07477
Residue:247
BDBM14543
NameBDBM14543
Synonyms:2-[6-(3-aminophenyl)-5-chloro-3-(cyclobutylamino)-2-oxo-1,2-dihydropyrazin-1-yl]-N-[(4-carbamimidoylphenyl)methyl]acetamide Pyrazinone Analog 29f
TypeSmall organic molecule
Emp. Form.C24H26ClN7O2
Mol. Mass.479.962
SMILESNC(=N)c1ccc(CNC(=O)Cn2c(c(Cl)nc(NC3CCC3)c2=O)-c2cccc(N)c2)cc1