Reaction Details
TargetNeutrophil collagenase
LigandBDBM50130102
Substrate/Competitorn/a
Meas. Tech.ChEBML_105213
Ki 13000±n/a nM
Citation Robinson, LAWilson, DMDelaet, NGBradley, EKDankwardt, SMCampbell, JAMartin, RLVan Wart, HEWalker, KASullivan, RW Novel inhibitors of procollagen C-proteinase. Part 2: glutamic acid hydroxamates. Bioorg Med Chem Lett13:2381-4 (2003) Neutrophil collagenase
Name:Neutrophil collagenase
Type:Enzyme
Mol. Mass.:53413.48
Organism:Homo sapiens (Human)
Description:P22894
Residue:467
BDBM50130102
NameBDBM50130102
Synonyms:(R)-2-[Benzo[1,3]dioxol-5-ylmethyl-(4-methoxy-2,3,6-trimethyl-benzenesulfonyl)-amino]-5-oxo-5-(4-phenyl-piperazin-1-yl)-pentanoic acid hydroxyamide | CHEMBL311367
TypeSmall organic molecule
Emp. Form.C33H40N4O8S
Mol. Mass.652.758
SMILESCOc1cc(C)c(c(C)c1C)S(=O)(=O)N(Cc1ccc2OCOc2c1)[C@H](CCC(=O)N1CCN(CC1)c1ccccc1)C(=O)NO