Reaction Details
TargetNeutrophil collagenase
LigandBDBM50130121
Substrate/Competitorn/a
Meas. Tech.ChEBML_105213
Ki 30000±n/a nM
Citation Robinson, LAWilson, DMDelaet, NGBradley, EKDankwardt, SMCampbell, JAMartin, RLVan Wart, HEWalker, KASullivan, RW Novel inhibitors of procollagen C-proteinase. Part 2: glutamic acid hydroxamates. Bioorg Med Chem Lett13:2381-4 (2003) Neutrophil collagenase
Name:Neutrophil collagenase
Type:Enzyme
Mol. Mass.:53413.48
Organism:Homo sapiens (Human)
Description:P22894
Residue:467
BDBM50130121
NameBDBM50130121
Synonyms:(R)-ethyl 4-(4-(N-(benzo[d][1,3]dioxol-5-ylmethyl)-4-methoxy-2,3,6-trimethylphenylsulfonamido)-5-(hydroxyamino)-5-oxopentanoyl)piperazine-1-carboxylate CHEMBL262758
TypeSmall organic molecule
Emp. Form.C30H40N4O10S
Mol. Mass.648.724
SMILESCCOC(=O)N1CCN(CC1)C(=O)CC[C@@H](N(Cc1ccc2OCOc2c1)S(=O)(=O)c1c(C)cc(OC)c(C)c1C)C(=O)NO