Reaction Details
TargetInterstitial collagenase
LigandBDBM50130108
Substrate/Competitorn/a
Meas. Tech.ChEBML_106322
Ki 120±n/a nM
Citation Robinson, LAWilson, DMDelaet, NGBradley, EKDankwardt, SMCampbell, JAMartin, RLVan Wart, HEWalker, KASullivan, RW Novel inhibitors of procollagen C-proteinase. Part 2: glutamic acid hydroxamates. Bioorg Med Chem Lett13:2381-4 (2003) Interstitial collagenase
Name:Interstitial collagenase
Type:Enzyme
Mol. Mass.:54010.26
Organism:Homo sapiens (Human)
Description: P03956
Residue:469
BDBM50130108
NameBDBM50130108
Synonyms:(R)-5-(4-Acetyl-piperazin-1-yl)-2-[benzo[1,3]dioxol-5-ylmethyl-(4-methoxy-benzenesulfonyl)-amino]-5-oxo-pentanoic acid hydroxyamide | CHEMBL432532
TypeSmall organic molecule
Emp. Form.C26H32N4O9S
Mol. Mass.576.619
SMILESCOc1ccc(cc1)S(=O)(=O)N(Cc1ccc2OCOc2c1)[C@H](CCC(=O)N1CCN(CC1)C(C)=O)C(=O)NO