Reaction Details
TargetBone morphogenetic protein 1
LigandBDBM50130142
Substrate/Competitorn/a
Meas. Tech.ChEBML_158896
Ki 1200±n/a nM
Citation Robinson, LAWilson, DMDelaet, NGBradley, EKDankwardt, SMCampbell, JAMartin, RLVan Wart, HEWalker, KASullivan, RW Novel inhibitors of procollagen C-proteinase. Part 2: glutamic acid hydroxamates. Bioorg Med Chem Lett13:2381-4 (2003) Bone morphogenetic protein 1
Name:Bone morphogenetic protein 1
Type:PROTEIN
Mol. Mass.:111254.03
Organism:Homo sapiens (Human)
Description:ChEMBL_518962
Residue:986
BDBM50130142
NameBDBM50130142
Synonyms:(R)-2-[Benzo[1,3]dioxol-5-ylmethyl-(4-methoxy-benzenesulfonyl)-amino]-pentanedioic acid 5-ethylamide 1-hydroxyamide | CHEMBL77000
TypeSmall organic molecule
Emp. Form.C22H27N3O8S
Mol. Mass.493.53
SMILESCCNC(=O)CC[C@@H](N(Cc1ccc2OCOc2c1)S(=O)(=O)c1ccc(OC)cc1)C(=O)NO