Reaction Details
TargetBone morphogenetic protein 1
LigandBDBM50130140
Substrate/Competitorn/a
Meas. Tech.ChEBML_158896
Ki>1000±n/a nM
Citation Robinson, LAWilson, DMDelaet, NGBradley, EKDankwardt, SMCampbell, JAMartin, RLVan Wart, HEWalker, KASullivan, RW Novel inhibitors of procollagen C-proteinase. Part 2: glutamic acid hydroxamates. Bioorg Med Chem Lett13:2381-4 (2003) Bone morphogenetic protein 1
Name:Bone morphogenetic protein 1
Type:PROTEIN
Mol. Mass.:111254.03
Organism:Homo sapiens (Human)
Description:ChEMBL_518962
Residue:986
BDBM50130140
NameBDBM50130140
Synonyms:(R)-2-[Benzo[1,3]dioxol-5-ylmethyl-(4-methoxy-benzenesulfonyl)-amino]-5-oxo-5-(4-pyridin-4-ylmethyl-piperazin-1-yl)-pentanoic acid hydroxyamide | CHEMBL76811
TypeSmall organic molecule
Emp. Form.C30H35N5O8S
Mol. Mass.625.693
SMILESCOc1ccc(cc1)S(=O)(=O)N(Cc1ccc2OCOc2c1)[C@H](CCC(=O)N1CCN(Cc2ccncc2)CC1)C(=O)NO