Reaction Details
TargetBone morphogenetic protein 1
LigandBDBM50130099
Substrate/Competitorn/a
Meas. Tech.ChEBML_158896
Ki 64±n/a nM
Citation Robinson, LAWilson, DMDelaet, NGBradley, EKDankwardt, SMCampbell, JAMartin, RLVan Wart, HEWalker, KASullivan, RW Novel inhibitors of procollagen C-proteinase. Part 2: glutamic acid hydroxamates. Bioorg Med Chem Lett13:2381-4 (2003) Bone morphogenetic protein 1
Name:Bone morphogenetic protein 1
Type:PROTEIN
Mol. Mass.:111254.03
Organism:Homo sapiens (Human)
Description:ChEMBL_518962
Residue:986
BDBM50130099
NameBDBM50130099
Synonyms:4-{(R)-4-[Benzo[1,3]dioxol-5-ylmethyl-(4-methoxy-benzenesulfonyl)-amino]-4-hydroxycarbamoyl-butyryl}-piperazine-1-carboxylic acid ethyl ester | CHEMBL80486
TypeSmall organic molecule
Emp. Form.C27H34N4O10S
Mol. Mass.606.645
SMILESCCOC(=O)N1CCN(CC1)C(=O)CC[C@@H](N(Cc1ccc2OCOc2c1)S(=O)(=O)c1ccc(OC)cc1)C(=O)NO