Reaction Details
Target5-hydroxytryptamine receptor 1A
LigandBDBM50130164
Substrate/Competitorn/a
Meas. Tech.ChEMBL_892 (CHEMBL835002)
Ki 0.980000±n/a nM
Citation Takeuchi, KKohn, TJHonigschmidt, NARocco, VPSpinazze, PGKoch, DJAtkinson, STHertel, LWNelson, DLWainscott, DBAhmad, LJShaw, JThrelkeld, PGWong, DT Advances Toward new antidepressants beyond SSRIs: 1-aryloxy-3-piperidinylpropan-2-ols with dual 5-HT(1A) receptor antagonism/SSRI activities. Part 2. Bioorg Med Chem Lett13:2393-7 (2003) 5-hydroxytryptamine receptor 1A
Name:5-hydroxytryptamine receptor 1A
Type:n/a
Mol. Mass.:46122.49
Organism:Homo sapiens (Human)
Description:n/a
Residue:422
BDBM50130164
NameBDBM50130164
Synonyms:(S)-1-[(4S,6R)-4-(4,5-Dimethoxy-benzo[b]thiophen-2-yl)-2-methyl-piperidin-1-yl]-3-(1H-indol-4-yloxy)-propan-2-ol | CHEMBL310063
TypeSmall organic molecule
Emp. Form.C27H32N2O4S
Mol. Mass.480.619
SMILESCOc1ccc2sc(cc2c1OC)[C@@H]1CCN(C[C@H](O)COc2cccc3[nH]ccc23)[C@@H](C)C1