Reaction Details
TargetSodium-dependent serotonin transporter
LigandBDBM50130172
Substrate/Competitorn/a
Meas. Tech.ChEBML_201993
Ki 0.070000±n/a nM
Citation Takeuchi, KKohn, TJHonigschmidt, NARocco, VPSpinazze, PGKoch, DJAtkinson, STHertel, LWNelson, DLWainscott, DBAhmad, LJShaw, JThrelkeld, PGWong, DT Advances Toward new antidepressants beyond SSRIs: 1-aryloxy-3-piperidinylpropan-2-ols with dual 5-HT(1A) receptor antagonism/SSRI activities. Part 2. Bioorg Med Chem Lett13:2393-7 (2003) Sodium-dependent serotonin transporter
Name:Sodium-dependent serotonin transporter
Type:Multi-pass membrane protein
Mol. Mass.:70168.43
Organism:Rattus norvegicus (rat)
Description:P31652
Residue:630
BDBM50130172
NameBDBM50130172
Synonyms:1-(3-Benzo[b]thiophen-2-yl-8-aza-bicyclo[3.2.1]oct-8-yl)-3-(1H-indol-4-yloxy)-propan-2-ol | CHEMBL309666
TypeSmall organic molecule
Emp. Form.C26H28N2O2S
Mol. Mass.432.578
SMILESO[C@H](COc1cccc2[nH]ccc12)CN1[C@H]2CC[C@@H]1C[C@H](C2)c1cc2ccccc2s1