Reaction Details
TargetEstrogen receptor beta
LigandBDBM50130177
Substrate/Competitorn/a
Meas. Tech.ChEBML_67687
IC50 1.7±n/a nM
Citation Miller, CPCollini, MDHarris, HA Constrained phytoestrogens and analogues as ERbeta selective ligands. Bioorg Med Chem Lett13:2399-403 (2003) Estrogen receptor beta
Name:Estrogen receptor beta
Type:Protein
Mol. Mass.:59238.43
Organism:Homo sapiens (Human)
Description:Q92731
Residue:530
BDBM50130177
NameBDBM50130177
Synonyms:2,6,8-Trihydroxy-10,11-dioxa-benzo[b]fluoren-5-one | CHEMBL312186
TypeSmall organic molecule
Emp. Form.C15H8O6
Mol. Mass.284.2204
SMILESOc1ccc2c(c1)oc1oc3cc(O)cc(O)c3c(=O)c21