Reaction Details
TargetNF-kappa-B essential modulator
LigandBDBM50130248
Substrate/Competitorn/a
Meas. Tech.ChEBML_84013
EC50 5000±n/a nM
Citation Castro, ACDang, LCSoucy, FGrenier, LMazdiyasni, HHottelet, MParent, LPien, CPalombella, VAdams, J Novel IKK inhibitors: beta-carbolines. Bioorg Med Chem Lett13:2419-22 (2003) NF-kappa-B essential modulator
Name:NF-kappa-B essential modulator
Type:PROTEIN
Mol. Mass.:48190.12
Organism:Homo sapiens (Human)
Description:ChEMBL_84013
Residue:419
BDBM50130248
NameBDBM50130248
Synonyms:CHEMBL79004 PS-1145
TypeSmall organic molecule
Emp. Form.C17H11ClN4O
Mol. Mass.322.748
SMILESClc1cc(NC(=O)c2cccnc2)c2[nH]c3cnccc3c2c1