Reaction Details
TargetDihydrofolate reductase
LigandBDBM50011320
Substrate/Competitorn/a
Meas. Tech.ChEMBL_216593 (CHEMBL821384)
Ki 0.042±n/a nM
Citation Pineda, PKanter, AMcIvor, RSBenkovic, SJRosowsky, AWagner, CR Dihydrofolate reductase mutant with exceptional resistance to methotrexate but not to trimetrexate. J Med Chem46:2816-8 (2003) 
 
Dihydrofolate reductase
Name:Dihydrofolate reductase
Type:Enzyme
Mol. Mass.:21608.82
Organism:Mus musculus (Mouse)
Description:n/a
Residue:187
BDBM50011320
NameBDBM50011320
Synonyms:CHEMBL18155 N-(4-Carboxy-4-{4-[(2,4-diamino-pteridin-6-ylmethyl)-amino]-benzoylamino}-butyl)-phthalamic acid(PT523)
TypeSmall organic molecule
Emp. Form.C27H27N9O6
Mol. Mass.573.56
SMILESNc1nc(N)c2nc(CNc3ccc(cc3)C(=O)NC(CCCNC(=O)c3ccccc3C(O)=O)C(O)=O)cnc2n1