Reaction Details
TargetBifunctional dihydrofolate reductase-thymidylate synthase
LigandBDBM18792
Substrate/Competitorn/a
Meas. Tech.ChEMBL_55399 (CHEMBL668408)
Ki 2.6±n/a nM
Citation Rastelli, GPacchioni, SSirawaraporn, WSirawaraporn, RParenti, MDFerrari, AM Docking and database screening reveal new classes of Plasmodium falciparum dihydrofolate reductase inhibitors. J Med Chem46:2834-45 (2003) 
 
Bifunctional dihydrofolate reductase-thymidylate synthase
Name:Bifunctional dihydrofolate reductase-thymidylate synthase
Type:Enzyme
Mol. Mass.:71822.51
Organism:Plasmodium falciparum (isolate K1 / Thailand)
Description:The mutant clone was prepared by cassette mutagenesis using wildtype pfDHFR as a template, and expressed in E. coli.
Residue:608
BDBM18792
NameBDBM18792
Synonyms:1-(4-chlorophenyl)-6,6-dimethyl-1,6-dihydro-1,3,5-triazine-2,4-diamine Chlorazin | Cycloguanil
TypeSmall organic molecule
Emp. Form.C11H14ClN5
Mol. Mass.251.715
SMILESCC1(C)N=C(N)N=C(N)N1c1ccc(Cl)cc1