Reaction Details
Target5-hydroxytryptamine receptor 1F
LigandBDBM50130445
Substrate/Competitorn/a
Meas. Tech.ChEMBL_2087 (CHEMBL616730)
Ki 7.3±n/a nM
Citation Filla, SAMathes, BMJohnson, KWPhebus, LACohen, MLNelson, DLZgombick, JMErickson, JASchenck, KWWainscott, DBBranchek, TASchaus, JM Novel potent 5-HT(1F) receptor agonists: structure-activity studies of a series of substituted N-[3-(1-methyl-4-piperidinyl)-1H-pyrrolo[3,2-b]pyridin-5-yl]amides. J Med Chem46:3060-71 (2003) 
 
5-hydroxytryptamine receptor 1F
Name:5-hydroxytryptamine receptor 1F
Type:Enzyme Catalytic Domain
Mol. Mass.:41724.68
Organism:Homo sapiens (Human)
Description:5-HT1F HTR1F HUMAN::P30939
Residue:366
BDBM50130445
NameBDBM50130445
Synonyms:CHEMBL105743 | N-[3-(1-Methyl-piperidin-4-yl)-1H-pyrrolo[3,2-b]pyridin-5-yl]-benzamide
TypeSmall organic molecule
Emp. Form.C20H22N4O
Mol. Mass.334.4149
SMILESCN1CCC(CC1)c1c[nH]c2ccc(NC(=O)c3ccccc3)nc12