Reaction Details
Target5-hydroxytryptamine receptor 1F
LigandBDBM50130463
Substrate/Competitorn/a
Meas. Tech.ChEMBL_2087 (CHEMBL616730)
Ki 7.5±n/a nM
Citation Filla, SAMathes, BMJohnson, KWPhebus, LACohen, MLNelson, DLZgombick, JMErickson, JASchenck, KWWainscott, DBBranchek, TASchaus, JM Novel potent 5-HT(1F) receptor agonists: structure-activity studies of a series of substituted N-[3-(1-methyl-4-piperidinyl)-1H-pyrrolo[3,2-b]pyridin-5-yl]amides. J Med Chem46:3060-71 (2003) 
 
5-hydroxytryptamine receptor 1F
Name:5-hydroxytryptamine receptor 1F
Type:Enzyme Catalytic Domain
Mol. Mass.:41724.68
Organism:Homo sapiens (Human)
Description:5-HT1F HTR1F HUMAN::P30939
Residue:366
BDBM50130463
NameBDBM50130463
Synonyms:4-Fluoro-benzenesulfonic acid 3-(1-methyl-piperidin-4-yl)-1H-pyrrolo[3,2-b]pyridin-5-yl ester | CHEMBL319920
TypeSmall organic molecule
Emp. Form.C19H20FN3O3S
Mol. Mass.389.444
SMILESCN1CCC(CC1)c1c[nH]c2ccc(OS(=O)(=O)c3ccc(F)cc3)nc12