Reaction Details
TargetThyroid hormone receptor beta
LigandBDBM50115668
Substrate/Competitorn/a
Meas. Tech.ChEMBL_210504 (CHEMBL811899)
Kd 0.1±n/a nM
Citation Yoshihara, HAApriletti, JWBaxter, JDScanlan, TS Structural determinants of selective thyromimetics. J Med Chem46:3152-61 (2003) 
 
Thyroid hormone receptor beta
Name:Thyroid hormone receptor beta
Type:Receptor
Mol. Mass.:52793.62
Organism:Homo sapiens (Human)
Description:Recombinant hThR was obtained from nuclear extracts from SF9 cells infected with baculovirus vectors encoding for ThRbeta 1.
Residue:461
BDBM50115668
NameBDBM50115668
Synonyms:3,5-dimethyl-4-(4'-hydroxy-3'-isopropylbenzyl)phenoxyacetic acid GC-1 US10544075, Compound GC-1 [4-(4-Hydroxy-3-isopropyl-benzyl)-3,5-dimethyl-phenoxy]-acetic acid(GC-1) | {4-[4-hydroxy-3-(1-methylethyl)benzyl]-3,5-dimethylphenoxy}acetic acid
TypeSmall organic molecule
Emp. Form.C20H24O4
Mol. Mass.328.4022
SMILESCC(C)c1cc(Cc2c(C)cc(OCC(O)=O)cc2C)ccc1O