Reaction Details
TargetThyroid hormone receptor alpha
LigandBDBM50130595
Substrate/Competitorn/a
Meas. Tech.ChEMBL_210492 (CHEMBL814599)
Kd 8.5±n/a nM
Citation Yoshihara, HAApriletti, JWBaxter, JDScanlan, TS Structural determinants of selective thyromimetics. J Med Chem46:3152-61 (2003) 
 
Thyroid hormone receptor alpha
Name:Thyroid hormone receptor alpha
Type:Receptor
Mol. Mass.:54818.00
Organism:Homo sapiens (Human)
Description:Recombinant hThR was obtained from nuclear extracts from SF9 cells infected with baculovirus vectors encoding for ThRalpha 1.
Residue:490
BDBM50130595
NameBDBM50130595
Synonyms:2-Amino-3-[4-(4-hydroxy-3-isopropyl-phenoxy)-3,5-dimethyl-phenyl]-propionic acid Dimethyl-isopropyl-T3 (DIMIT)
TypeSmall organic molecule
Emp. Form.C20H25NO4
Mol. Mass.343.4168
SMILESCC(C)c1cc(Oc2c(C)cc(C[C@H](N)C(O)=O)cc2C)ccc1O