Reaction Details
TargetThyroid hormone receptor alpha
LigandBDBM50130594
Substrate/Competitorn/a
Meas. Tech.ChEMBL_210492 (CHEMBL814599)
Kd 0.69±n/a nM
Citation Yoshihara, HAApriletti, JWBaxter, JDScanlan, TS Structural determinants of selective thyromimetics. J Med Chem46:3152-61 (2003) 
 
Thyroid hormone receptor alpha
Name:Thyroid hormone receptor alpha
Type:Receptor
Mol. Mass.:54818.00
Organism:Homo sapiens (Human)
Description:Recombinant hThR was obtained from nuclear extracts from SF9 cells infected with baculovirus vectors encoding for ThRalpha 1.
Residue:490
BDBM50130594
NameBDBM50130594
Synonyms:3-[4-(4-Hydroxy-3-isopropyl-benzyl)-3,5-dimethyl-phenyl]-propionic acid | CHEMBL322361
TypeSmall organic molecule
Emp. Form.C21H26O3
Mol. Mass.326.4293
SMILESCC(C)c1cc(Cc2c(C)cc(CCC(O)=O)cc2C)ccc1O