Reaction Details
TargetPotassium voltage-gated channel subfamily KQT member 2
LigandBDBM50130610
Substrate/Competitorn/a
Meas. Tech.ChEMBL_219172 (CHEMBL821683)
EC50 6000±n/a nM
Citation Wu, YJBoissard, CGGreco, CGribkoff, VKHarden, DGHe, HL'Heureux, AKang, SHKinney, GGKnox, RJNatale, JNewton, AELehtinen-Oboma, SSinz, MWSivarao, DVStarrett, JESun, LQTertyshnikova, SThompson, MWWeaver, DWong, HSZhang, LDworetzky, SI (S)-N-[1-(3-morpholin-4-ylphenyl)ethyl]- 3-phenylacrylamide: an orally bioavailable KCNQ2 opener with significant activity in a cortical spreading depression model of migraine. J Med Chem46:3197-200 (2003) 
 
Potassium voltage-gated channel subfamily KQT member 2
Name:Potassium voltage-gated channel subfamily KQT member 2
Type:PROTEIN
Mol. Mass.:84494.02
Organism:Mus musculus
Description:ChEMBL_990142
Residue:759
BDBM50130610
NameBDBM50130610
Synonyms:(E)-N-[(S)-1-(3-Morpholin-4-yl-phenyl)-ethyl]-3-phenyl-acrylamide CHEMBL317935 | N-[1-(3-Morpholin-4-yl-phenyl)-ethyl]-3-phenyl-acrylamide
TypeSmall organic molecule
Emp. Form.C21H24N2O2
Mol. Mass.336.4275
SMILESC[C@H](NC(=O)\C=C\c1ccccc1)c1cccc(c1)N1CCOCC1