Reaction Details
TargetMu-type opioid receptor
LigandBDBM50130617
Substrate/Competitorn/a
Meas. Tech.ChEMBL_145457 (CHEMBL751090)
IC50 3.1±n/a nM
Citation Okada, YTsuda, YFujita, YYokoi, TSasaki, YAmbo, AKonishi, RNagata, MSalvadori, SJinsmaa, YBryant, SDLazarus, LH Unique high-affinity synthetic mu-opioid receptor agonists with central- and systemic-mediated analgesia. J Med Chem46:3201-9 (2003) 
 
Mu-type opioid receptor
Name:Mu-type opioid receptor
Type:Enzyme Catalytic Domain
Mol. Mass.:11165.58
Organism:GUINEA PIG
Description:P97266
Residue:98
BDBM50130617
NameBDBM50130617
Synonyms:2-Amino-N-{6-[2-amino-3-(4-hydroxy-2,6-dimethyl-phenyl)-propionylamino]-hexyl}-3-(4-hydroxy-2,6-dimethyl-phenyl)-propionamide | CHEMBL108808
TypeSmall organic molecule
Emp. Form.C28H42N4O4
Mol. Mass.498.6575
SMILESCc1cc(O)cc(C)c1C[C@H](N)C(=O)NCCCCCCNC(=O)[C@H](N)Cc1c(C)cc(O)cc1C