Reaction Details
TargetDelta-type opioid receptor
LigandBDBM50130611
Substrate/Competitorn/a
Meas. Tech.ChEMBL_145904 (CHEMBL750393)
IC50>10000±n/a nM
Citation Okada, YTsuda, YFujita, YYokoi, TSasaki, YAmbo, AKonishi, RNagata, MSalvadori, SJinsmaa, YBryant, SDLazarus, LH Unique high-affinity synthetic mu-opioid receptor agonists with central- and systemic-mediated analgesia. J Med Chem46:3201-9 (2003) 
 
Delta-type opioid receptor
Name:Delta-type opioid receptor
Type:Enzyme Catalytic Domain
Mol. Mass.:40577.25
Organism:MOUSE
Description:P32300
Residue:372
BDBM50130611
NameBDBM50130611
Synonyms:2-Amino-N-{4-[2-amino-3-(4-hydroxy-2,6-dimethyl-phenyl)-propionylamino]-butyl}-3-(4-hydroxy-2,6-dimethyl-phenyl)-propionamide | CHEMBL108640
TypeSmall organic molecule
Emp. Form.C26H38N4O4
Mol. Mass.470.6043
SMILESCc1cc(O)cc(C)c1C[C@H](N)C(=O)NCCCCNC(=O)[C@H](N)Cc1c(C)cc(O)cc1C