Reaction Details
TargetCorticotropin-releasing factor receptor 1
LigandBDBM50130959
Substrate/Competitorn/a
Meas. Tech.ChEBML_51266
Ki 15±n/a nM
Citation Hodgetts, KJYoon, THuang, JGulianello, MKieltyka, APrimus, RBrodbeck, RDe Lombaert, SDoller, D 2-Aryl-3,6-dialkyl-5-dialkylaminopyrimidin-4-ones as novel crf-1 receptor antagonists. Bioorg Med Chem Lett13:2497-500 (2003) Corticotropin-releasing factor receptor 1
Name:Corticotropin-releasing factor receptor 1
Type:Enzyme
Mol. Mass.:50744.31
Organism:Homo sapiens (Human)
Description:P34998
Residue:444
BDBM50130959
NameBDBM50130959
Synonyms:2-(2,4-Dichloro-phenyl)-5-dipropylamino-3-ethyl-6-methyl-3H-pyrimidin-4-one | CHEMBL84339
TypeSmall organic molecule
Emp. Form.C19H25Cl2N3O
Mol. Mass.382.327
SMILESCCCN(CCC)c1c(C)nc(-c2ccc(Cl)cc2Cl)n(CC)c1=O