Reaction Details
Target5-hydroxytryptamine receptor 2A
LigandBDBM50131083
Substrate/Competitorn/a
Meas. Tech.ChEBML_2632
Ki 3.2±n/a nM
Citation Peddi, SRoth, BLGlennon, RAWestkaemper, RB Ring substituted analogues of 5-aminomethyl-10,11-dihydro-dibenzo[a,d]cycloheptene (AMDH): potential modes of binding to the 5-HT(2A) receptor. Bioorg Med Chem Lett13:2565-8 (2003) 5-hydroxytryptamine receptor 2A
Name:5-hydroxytryptamine receptor 2A
Type:G Protein-Coupled Receptor (GPCR)
Mol. Mass.:52852.05
Organism:Rattus norvegicus (rat)
Description:Rat cortex membranes 5-HT2A receptors.
Residue:471
BDBM50131083
NameBDBM50131083
Synonyms:3-(3-Phenylpropyl)-9-aminomethyl-9,10-dihydroanthracene CHEMBL83082
TypeSmall organic molecule
Emp. Form.C24H25N
Mol. Mass.327.462
SMILESNCC1c2ccccc2Cc2cc(CCCc3ccccc3)ccc12