Reaction Details
TargetTyrosine-protein phosphatase non-receptor type 1
LigandBDBM50131098
Substrate/Competitorn/a
Meas. Tech.ChEMBL_162416 (CHEMBL771819)
Ki 29000±n/a nM
Citation Lee, KGao, YYao, ZJPhan, JWu, LLiang, JWaugh, DSZhang, ZYBurke, TR Tripeptide inhibitors of Yersinia protein-tyrosine phosphatase. Bioorg Med Chem Lett13:2577-81 (2003) Tyrosine-protein phosphatase non-receptor type 1
Name:Tyrosine-protein phosphatase non-receptor type 1
Type:Protein phosphatase
Mol. Mass.:49963.76
Organism:Homo sapiens (Human)
Description:Human recombinant GST-fusion PTP1B (1-435).
Residue:435
BDBM50131098
NameBDBM50131098
Synonyms:2-(4-{2-((S)-1-(S)-Carbamoyl-3-methyl-butylcarbamoyl)-2-[4-carboxy-2-(9H-fluoren-9-ylmethoxycarbonylamino)-butyrylamino]-ethyl}-phenoxy)-malonic acid | CHEMBL315107
TypeSmall organic molecule
Emp. Form.C38H42N4O12
Mol. Mass.746.7597
SMILESCC(C)C[C@H](NC(=O)[C@H](Cc1ccc(OC(C(O)=O)C(O)=O)cc1)NC(=O)[C@H](CCC(O)=O)NC(=O)OCC1c2ccccc2-c2ccccc12)C(N)=O