Reaction Details
TargetTyrosine-protein kinase Lck
LigandBDBM50131114
Substrate/Competitorn/a
Meas. Tech.ChEBML_221493
IC50 1±n/a nM
Citation Das, JMoquin, RVLin, JLiu, CDoweyko, AMDeFex, HFFang, QPang, SPitt, SShen, DRSchieven, GLBarrish, JCWityak, J Discovery of 2-amino-heteroaryl-benzothiazole-6-anilides as potent p56(lck) inhibitors. Bioorg Med Chem Lett13:2587-90 (2003) Tyrosine-protein kinase Lck
Name:Tyrosine-protein kinase Lck
Type:n/a
Mol. Mass.:57987.83
Organism:Homo sapiens (Human)
Description:P06239
Residue:509
BDBM50131114
NameBDBM50131114
Synonyms:2-{6-Methyl-2-[(tetrahydro-furan-2-ylmethyl)-amino]-pyrimidin-4-ylamino}-benzothiazole-6-carboxylic acid (2-chloro-6-methyl-phenyl)-amide | CHEMBL432189
TypeSmall organic molecule
Emp. Form.C25H25ClN6O2S
Mol. Mass.509.023
SMILESCc1cc(Nc2nc3ccc(cc3s2)C(=O)Nc2c(C)cccc2Cl)nc(NCC2CCCO2)n1