Reaction Details
TargetTyrosine-protein kinase Lck
LigandBDBM50131141
Substrate/Competitorn/a
Meas. Tech.ChEBML_221493
IC50 6±n/a nM
Citation Das, JMoquin, RVLin, JLiu, CDoweyko, AMDeFex, HFFang, QPang, SPitt, SShen, DRSchieven, GLBarrish, JCWityak, J Discovery of 2-amino-heteroaryl-benzothiazole-6-anilides as potent p56(lck) inhibitors. Bioorg Med Chem Lett13:2587-90 (2003) Tyrosine-protein kinase Lck
Name:Tyrosine-protein kinase Lck
Type:n/a
Mol. Mass.:57987.83
Organism:Homo sapiens (Human)
Description:P06239
Residue:509
BDBM50131141
NameBDBM50131141
Synonyms:2-[6-(2-Amino-2-methyl-propylamino)-pyridin-2-ylamino]-benzothiazole-6-carboxylic acid (2-chloro-6-methyl-phenyl)-amide | CHEMBL87727
TypeSmall organic molecule
Emp. Form.C24H25ClN6OS
Mol. Mass.481.013
SMILESCc1cccc(Cl)c1NC(=O)c1ccc2nc(Nc3cccc(NCC(C)(C)N)n3)sc2c1