Reaction Details
TargetTyrosine-protein kinase Lck
LigandBDBM50131157
Substrate/Competitorn/a
Meas. Tech.ChEBML_221493
IC50 1±n/a nM
Citation Das, JMoquin, RVLin, JLiu, CDoweyko, AMDeFex, HFFang, QPang, SPitt, SShen, DRSchieven, GLBarrish, JCWityak, J Discovery of 2-amino-heteroaryl-benzothiazole-6-anilides as potent p56(lck) inhibitors. Bioorg Med Chem Lett13:2587-90 (2003) Tyrosine-protein kinase Lck
Name:Tyrosine-protein kinase Lck
Type:n/a
Mol. Mass.:57987.83
Organism:Homo sapiens (Human)
Description:P06239
Residue:509
BDBM50131157
NameBDBM50131157
Synonyms:2-[4-(4-Methylamino-piperazin-1-ylmethyl)-pyridin-2-ylamino]-benzothiazole-6-carboxylic acid (2-chloro-6-methyl-phenyl)-amide | CHEMBL86939
TypeSmall organic molecule
Emp. Form.C26H28ClN7OS
Mol. Mass.522.065
SMILESCNN1CCN(Cc2ccnc(Nc3nc4ccc(cc4s3)C(=O)Nc3c(C)cccc3Cl)c2)CC1