Reaction Details
TargetTyrosine-protein kinase Lck
LigandBDBM50129307
Substrate/Competitorn/a
Meas. Tech.ChEBML_221493
IC50 4±n/a nM
Citation Das, JMoquin, RVLin, JLiu, CDoweyko, AMDeFex, HFFang, QPang, SPitt, SShen, DRSchieven, GLBarrish, JCWityak, J Discovery of 2-amino-heteroaryl-benzothiazole-6-anilides as potent p56(lck) inhibitors. Bioorg Med Chem Lett13:2587-90 (2003) Tyrosine-protein kinase Lck
Name:Tyrosine-protein kinase Lck
Type:n/a
Mol. Mass.:57987.83
Organism:Homo sapiens (Human)
Description:P06239
Residue:509
BDBM50129307
NameBDBM50129307
Synonyms:2-(3-tert-Butyl-ureido)-benzothiazole-6-carboxylic acid (2-chloro-6-methyl-phenyl)-amide | CHEMBL67237
TypeSmall organic molecule
Emp. Form.C20H21ClN4O2S
Mol. Mass.416.924
SMILESCc1cccc(Cl)c1NC(=O)c1ccc2nc(NC(=O)NC(C)(C)C)sc2c1