Reaction Details
TargetC-X-C chemokine receptor type 2
LigandBDBM50131188
Substrate/Competitorn/a
Meas. Tech.ChEBML_44674
IC50 170±n/a nM
Citation Baxter, ABennion, CBent, JBoden, KBrough, SCooper, AKinchin, EKindon, NMcInally, TMortimore, MRoberts, BUnitt, J Hit-to-lead studies: the discovery of potent, orally bioavailable triazolethiol CXCR2 receptor antagonists. Bioorg Med Chem Lett13:2625-8 (2003) C-X-C chemokine receptor type 2
Name:C-X-C chemokine receptor type 2
Type:Protein
Mol. Mass.:40767.88
Organism:Homo sapiens (Human)
Description:P25025
Residue:360
BDBM50131188
NameBDBM50131188
Synonyms:5-(2,4-Dichloro-phenyl)-2-(3-phenoxy-benzyl)-2H-[1,2,4]triazole-3-thiol | CHEMBL315588
TypeSmall organic molecule
Emp. Form.C21H15Cl2N3OS
Mol. Mass.428.334
SMILESClc1ccc(-c2nn(Cc3cccc(Oc4ccccc4)c3)c(=S)[nH]2)c(Cl)c1