Reaction Details
TargetC-X-C chemokine receptor type 2
LigandBDBM50131204
Substrate/Competitorn/a
Meas. Tech.ChEBML_44674
IC50 300±n/a nM
Citation Baxter, ABennion, CBent, JBoden, KBrough, SCooper, AKinchin, EKindon, NMcInally, TMortimore, MRoberts, BUnitt, J Hit-to-lead studies: the discovery of potent, orally bioavailable triazolethiol CXCR2 receptor antagonists. Bioorg Med Chem Lett13:2625-8 (2003) C-X-C chemokine receptor type 2
Name:C-X-C chemokine receptor type 2
Type:Protein
Mol. Mass.:40767.88
Organism:Homo sapiens (Human)
Description:P25025
Residue:360
BDBM50131204
NameBDBM50131204
Synonyms:2-(4-Chloro-benzyl)-5-(2,4-dichloro-phenyl)-2H-[1,2,4]triazole-3-thiol | CHEMBL315811
TypeSmall organic molecule
Emp. Form.C15H10Cl3N3S
Mol. Mass.370.684
SMILESClc1ccc(Cn2nc([nH]c2=S)-c2ccc(Cl)cc2Cl)cc1