Reaction Details
TargetC-X-C chemokine receptor type 2
LigandBDBM50131195
Substrate/Competitorn/a
Meas. Tech.ChEBML_44674
IC50 3500±n/a nM
Citation Baxter, ABennion, CBent, JBoden, KBrough, SCooper, AKinchin, EKindon, NMcInally, TMortimore, MRoberts, BUnitt, J Hit-to-lead studies: the discovery of potent, orally bioavailable triazolethiol CXCR2 receptor antagonists. Bioorg Med Chem Lett13:2625-8 (2003) C-X-C chemokine receptor type 2
Name:C-X-C chemokine receptor type 2
Type:Protein
Mol. Mass.:40767.88
Organism:Homo sapiens (Human)
Description:P25025
Residue:360
BDBM50131195
NameBDBM50131195
Synonyms:4-(1-Benzyl-5-mercapto-1H-[1,2,4]triazol-3-yl)-benzonitrile | CHEMBL312883
TypeSmall organic molecule
Emp. Form.C16H12N4S
Mol. Mass.292.358
SMILESS=c1[nH]c(nn1Cc1ccccc1)-c1ccc(cc1)C#N