Reaction Details
TargetPeptide deformylase, mitochondrial
LigandBDBM50131299
Substrate/Competitorn/a
Meas. Tech.ChEBML_154178
IC50 70±n/a nM
Citation Davies, SJAyscough, APBeckett, RPBragg, RAClements, JMDoel, SGrew, CLaunchbury, SBPerkins, GMPratt, LMSmith, HKSpavold, ZMThomas, SWTodd, RSWhittaker, M Structure-activity relationships of the peptide deformylase inhibitor BB-3497: modification of the methylene spacer and the P1' side chain. Bioorg Med Chem Lett13:2709-13 (2003) Peptide deformylase, mitochondrial
Name:Peptide deformylase, mitochondrial
Type:PROTEIN
Mol. Mass.:27023.25
Organism:Homo sapiens (Human)
Description:ChEMBL_154318
Residue:243
BDBM50131299
NameBDBM50131299
Synonyms:(S)-2-{(R)-2-[(Formyl-hydroxy-amino)-methyl]-butyrylamino}-3,3,N,N-tetramethyl-butyramide | CHEMBL90091
TypeSmall organic molecule
Emp. Form.C14H27N3O4
Mol. Mass.301.3819
SMILESCC[C@H](CN(O)C=O)C(=O)N[C@H](C(=O)N(C)C)C(C)(C)C