Reaction Details
TargetPeptide deformylase, mitochondrial
LigandBDBM50131302
Substrate/Competitorn/a
Meas. Tech.ChEBML_154178
IC50 20±n/a nM
Citation Davies, SJAyscough, APBeckett, RPBragg, RAClements, JMDoel, SGrew, CLaunchbury, SBPerkins, GMPratt, LMSmith, HKSpavold, ZMThomas, SWTodd, RSWhittaker, M Structure-activity relationships of the peptide deformylase inhibitor BB-3497: modification of the methylene spacer and the P1' side chain. Bioorg Med Chem Lett13:2709-13 (2003) Peptide deformylase, mitochondrial
Name:Peptide deformylase, mitochondrial
Type:PROTEIN
Mol. Mass.:27023.25
Organism:Homo sapiens (Human)
Description:ChEMBL_154318
Residue:243
BDBM50131302
NameBDBM50131302
Synonyms:(R)-2-[(Formyl-hydroxy-amino)-methyl]-5-methyl-hexanoic acid ((S)-1-dimethylcarbamoyl-2,2-dimethyl-propyl)-amide | CHEMBL91882
TypeSmall organic molecule
Emp. Form.C17H33N3O4
Mol. Mass.343.4616
SMILESCC(C)CC[C@H](CN(O)C=O)C(=O)N[C@H](C(=O)N(C)C)C(C)(C)C