Reaction Details
TargetPeptide deformylase, mitochondrial
LigandBDBM50131309
Substrate/Competitorn/a
Meas. Tech.ChEBML_154178
IC50 500±n/a nM
Citation Davies, SJAyscough, APBeckett, RPBragg, RAClements, JMDoel, SGrew, CLaunchbury, SBPerkins, GMPratt, LMSmith, HKSpavold, ZMThomas, SWTodd, RSWhittaker, M Structure-activity relationships of the peptide deformylase inhibitor BB-3497: modification of the methylene spacer and the P1' side chain. Bioorg Med Chem Lett13:2709-13 (2003) Peptide deformylase, mitochondrial
Name:Peptide deformylase, mitochondrial
Type:PROTEIN
Mol. Mass.:27023.25
Organism:Homo sapiens (Human)
Description:ChEMBL_154318
Residue:243
BDBM50131309
NameBDBM50131309
Synonyms:(S)-2-[(R)-2-(4-Chloro-phenyl)-3-(formyl-hydroxy-amino)-propionylamino]-3,3,N,N-tetramethyl-butyramide | CHEMBL94198
TypeSmall organic molecule
Emp. Form.C18H26ClN3O4
Mol. Mass.383.87
SMILESCN(C)C(=O)[C@@H](NC(=O)[C@@H](CN(O)C=O)c1ccc(Cl)cc1)C(C)(C)C