Reaction Details
TargetAlpha-2A adrenergic receptor
LigandBDBM50131346
Substrate/Competitorn/a
Meas. Tech.ChEMBL_33076 (CHEMBL647723)
Ki 16.0±n/a nM
Citation Andrés, JIAlcázar, JAlonso, JMAlvarez, RMCid, JMDe Lucas, AIFernández, JMartínez, SNieto, CPastor, JBakker, MHBiesmans, IHeylen, LIMegens, AA Synthesis of 3a,4-dihydro-3H-[1]benzopyrano[4,3-c]isoxazoles, displaying combined 5-HT uptake inhibiting and alpha(2)-adrenoceptor antagonistic activities: a novel series of potential antidepressants. Bioorg Med Chem Lett13:2719-25 (2003) Alpha-2A adrenergic receptor
Name:Alpha-2A adrenergic receptor
Type:Enzyme
Mol. Mass.:48979.91
Organism:Homo sapiens (Human)
Description:P08913
Residue:450
BDBM50131346
NameBDBM50131346
Synonyms:(3R,3aS)-7,8-Dimethoxy-3-[4-((E)-2-methyl-3-phenyl-allyl)-piperazin-1-ylmethyl]-3a,4-dihydro-3H-chromeno[4,3-c]isoxazole CHEMBL91157
TypeSmall organic molecule
Emp. Form.C27H33N3O4
Mol. Mass.463.5686
SMILESCOc1cc2OC[C@H]3[C@H](CN4CCN(C\C(C)=C\c5ccccc5)CC4)ON=C3c2cc1OC