Reaction Details
TargetStromelysin-1
LigandBDBM50131386
Substrate/Competitorn/a
Meas. Tech.ChEBML_104872
Ki 1.7±n/a nM
Citation Moriyama, HTsukida, TInoue, YKondo, HYoshino, KNishimura, S Structure--activity relationships of azasugar-based MMP/ADAM inhibitors. Bioorg Med Chem Lett13:2737-40 (2003) Stromelysin-1
Name:Stromelysin-1
Type:Enzyme
Mol. Mass.:53973.13
Organism:Homo sapiens (Human)
Description: P08254
Residue:477
BDBM50131386
NameBDBM50131386
Synonyms:(2R,3S,4R,5S)-3,4,5-Trihydroxy-1-(4-methoxy-benzenesulfonyl)-piperidine-2-carboxylic acid hydroxyamide CHEMBL92767
TypeSmall organic molecule
Emp. Form.C13H18N2O8S
Mol. Mass.362.356
SMILESCOc1ccc(cc1)S(=O)(=O)N1C[C@H](O)[C@@H](O)[C@@H](O)[C@@H]1C(=O)NO