Reaction Details
TargetStromelysin-1
LigandBDBM50063917
Substrate/Competitorn/a
Meas. Tech.ChEBML_104872
Ki 84±n/a nM
Citation Moriyama, HTsukida, TInoue, YKondo, HYoshino, KNishimura, S Structure--activity relationships of azasugar-based MMP/ADAM inhibitors. Bioorg Med Chem Lett13:2737-40 (2003) Stromelysin-1
Name:Stromelysin-1
Type:Enzyme
Mol. Mass.:53973.13
Organism:Homo sapiens (Human)
Description: P08254
Residue:477
BDBM50063917
NameBDBM50063917
Synonyms:(2S,3R)-N(4)-[(2S)-3,3-dimethyl-1-(methylamino)-1-oxobutan-2-yl]-N(1),2-dihydroxy-3-(2-methylpropyl)butanediamide cid_119031 | marimastat
TypeSmall organic molecule
Emp. Form.C15H29N3O5
Mol. Mass.331.4079
SMILESCNC(=O)[C@@H](NC(=O)[C@H](CC(C)C)[C@H](O)C(=O)NO)C(C)(C)C