Reaction Details
TargetReceptor-type tyrosine-protein phosphatase alpha
LigandBDBM50131550
Substrate/Competitorn/a
Meas. Tech.ChEMBL_207134 (CHEMBL805118)
Ki 24±n/a nM
Citation Liu, GXin, ZLiang, HAbad-Zapatero, CHajduk, PJJanowick, DASzczepankiewicz, BGPei, ZHutchins, CWBallaron, SJStashko, MALubben, THBerg, CERondinone, CMTrevillyan, JMJirousek, MR Selective protein tyrosine phosphatase 1B inhibitors: targeting the second phosphotyrosine binding site with non-carboxylic acid-containing ligands. J Med Chem46:3437-40 (2003) 
 
Receptor-type tyrosine-protein phosphatase alpha
Name:Receptor-type tyrosine-protein phosphatase alpha
Type:Enzyme
Mol. Mass.:90719.02
Organism:Homo sapiens (Human)
Description:P18433
Residue:802
BDBM50131550
NameBDBM50131550
Synonyms:(3S)-3-{[(1S)-1-carbamoyl-2-{4-[difluoro(phosphono)methyl]phenyl}ethyl]carbamoyl}-3-(2-{4-[difluoro(phosphono)methyl]phenyl}acetamido)propanoic acid CHEMBL326115 | N-{1-Carbamoyl-2-[4-(difluoro-phosphono-methyl)-phenyl]-ethyl}-3-{2-[4-(difluoro-phosphono-methyl)-phenyl]-acetylamino}-succinamic acid
TypeSmall organic molecule
Emp. Form.C23H25F4N3O11P2
Mol. Mass.657.3992
SMILESNC(=O)[C@H](Cc1ccc(cc1)C(F)(F)P(O)(O)=O)NC(=O)[C@H](CC(O)=O)NC(=O)Cc1ccc(cc1)C(F)(F)P(O)(O)=O