Reaction Details
TargetTyrosine-protein phosphatase non-receptor type 1
LigandBDBM50131551
Substrate/Competitorn/a
Meas. Tech.ChEMBL_162277 (CHEMBL770975)
Ki 1600±n/a nM
Citation Liu, GXin, ZLiang, HAbad-Zapatero, CHajduk, PJJanowick, DASzczepankiewicz, BGPei, ZHutchins, CWBallaron, SJStashko, MALubben, THBerg, CERondinone, CMTrevillyan, JMJirousek, MR Selective protein tyrosine phosphatase 1B inhibitors: targeting the second phosphotyrosine binding site with non-carboxylic acid-containing ligands. J Med Chem46:3437-40 (2003) 
 
Tyrosine-protein phosphatase non-receptor type 1
Name:Tyrosine-protein phosphatase non-receptor type 1
Type:Protein phosphatase
Mol. Mass.:49963.76
Organism:Homo sapiens (Human)
Description:Human recombinant GST-fusion PTP1B (1-435).
Residue:435
BDBM50131551
NameBDBM50131551
Synonyms:2-carboxy(2-ethyl-4-{2-methylcarboxamido-2-[4-(2-methyloxycarbonylphenoxy)butylcarbamoyl]ethyl}phenyl)carboxamidobenzoic acid | CHEMBL116744
TypeSmall organic molecule
Emp. Form.C34H37N3O10
Mol. Mass.647.6717
SMILESCCc1cc(CC(NC(C)=O)C(=O)NCCCCOc2ccccc2C(=O)OC)ccc1N(C(=O)C(O)=O)c1ccccc1C(O)=O