Reaction Details
TargetMatrix metalloproteinase-14
LigandBDBM50063918
Substrate/Competitorn/a
Meas. Tech.ChEMBL_106775 (CHEMBL717146)
IC50 4.6±n/a nM
Citation Fray, MJDickinson, RPHuggins, JPOccleston, NL A potent, selective inhibitor of matrix metalloproteinase-3 for the topical treatment of chronic dermal ulcers. J Med Chem46:3514-25 (2003) 
 
Matrix metalloproteinase-14
Name:Matrix metalloproteinase-14
Type:Protein
Mol. Mass.:65900.19
Organism:Homo sapiens (Human)
Description:P50281
Residue:582
BDBM50063918
NameBDBM50063918
Synonyms:(2R,3S)-N*4*-Hydroxy-2-isobutyl-N*1*-((S)-1-methylcarbamoyl-2-phenyl-ethyl)-3-(thiophen-2-ylsulfanylmethyl)-succinamide 4-Methyl-2-[1-methyl-2-(thiophen-2-ylsulfanyl)-ethyl]-pentanoic acid (1-methylcarbamoyl-2-phenyl-ethyl)-amide BB-94 N*4*-Hydroxy-2-isobutyl-N*1*-(1-methylcarbamoyl-2-phenyl-ethyl)-3-(thiophen-2-ylsulfanylmethyl)-succinamide
TypeSmall organic molecule
Emp. Form.C23H31N3O4S2
Mol. Mass.477.64
SMILESCNC(=O)[C@H](Cc1ccccc1)NC(=O)[C@H](CC(C)C)[C@H](CSc1cccs1)C(=O)NO