Reaction Details
Target5-hydroxytryptamine receptor 1A
LigandBDBM50131712
Substrate/Competitorn/a
Meas. Tech.ChEMBL_1120 (CHEMBL616065)
Ki 1.16±n/a nM
Citation Betti, LCorelli, FFloridi, MGiannaccini, GMaccari, LManetti, FStrappaghetti, GBotta, M Alpha1-adrenoceptor antagonists. 6. Structural optimization of pyridazinone-arylpiperazines. Study of the influence on affinity and selectivity of cyclic substituents at the pyridazinone ring and alkoxy groups at the arylpiperazine moiety. J Med Chem46:3555-8 (2003) 
 
5-hydroxytryptamine receptor 1A
Name:5-hydroxytryptamine receptor 1A
Type:G Protein-Coupled Receptor (GPCR)
Mol. Mass.:46445.29
Organism:Rattus norvegicus (rat)
Description:Binding assays were performed using rat hippocampal membranes.
Residue:422
BDBM50131712
NameBDBM50131712
Synonyms:5-Chloro-4-[4-(furan-2-carbonyl)-piperazin-1-yl]-2-{7-[4-(2-isopropoxy-phenyl)-piperazin-1-yl]-heptyl}-2H-pyridazin-3-one | CHEMBL118770
TypeSmall organic molecule
Emp. Form.C33H45ClN6O4
Mol. Mass.625.201
SMILESCC(C)Oc1ccccc1N1CCN(CCCCCCCn2ncc(Cl)c(N3CCN(CC3)C(=O)c3ccco3)c2=O)CC1